therapy (Qualifier)
type: Qualifier
type: Concept
narrower: radiotherapy (Qualifier)
preferred label: thérapie (Qualificatif) @fr

radiotherapy (Qualifier)
type: Qualifier
type: Concept
created: 1973-12-27
established: 1966-01-01
modified: 2003-07-24
alternative label: RT (Qualifier)
alternative label: RADIOTHER (Qualifier)
broader: therapy (Qualifier)
in scheme: JVR
preferred label: radiothérapie (Qualificatif) @fr
scope note: Used with disease headings for the therapeutic use of ionizing and nonionizing radiation. It includes the use of radioisotope therapy.
scope note: S'applique aux maladies pour l'utilisation de radiations ionisantes ou non ionisantes dans un but thérapeutique. Il inclut les traitements par radio-isotopes. @fr