enzymology (Qualifier)
type: Concept
type: Qualifier
created: 1973-12-27
established: 1966-01-01
modified: 2007-07-10
alternative label: ENZYMOL (Qualifier)
alternative label: EN (Qualifier)
broader: metabolism (Qualifier)
in scheme: JVR
preferred label: enzymologie (Qualificatif) @fr
scope note: Used with organisms, except vertebrates, and with organs and tissues. It is also used with diseases for enzymes during the course of the disease, but excludes diagnostic enzyme tests, for which "diagnosis" is used.
scope note: S'applique aux organismes, à l'exclusion des vertébrés, ainsi qu’aux organes et aux tissus. Il s'applique aussi aux maladies pour les enzymes au cours de ces maladies. Il exclut les tests enzymatiques à visée diagnostique, pour lesquels le qualificatif "diagnostic” est utilisé. @fr

metabolism (Qualifier)
type: Qualifier
type: Concept
narrower: enzymology (Qualifier)
preferred label: métabolisme (Qualificatif) @fr