isolation & purification (Qualifier)
type: Concept
type: Qualifier
created: 1973-12-27
established: 1966-01-01
modified: 2017-04-11
alternative label: ISOL (Qualifier)
alternative label: IP (Qualifier)
broader: JVR-Q3979798-W
in scheme: JVR
preferred label: isolement et purification (Qualificatif) @fr
scope note: S'applique aux bactéries, aux virus, aux champignons, aux protozoaires et aux helminthes pour l'obtention de souches pures, ainsi que pour la détection ou l'identification des organismes par l’analyse de leur ADN, par des méthodes immunologiques ou autres, y compris des techniques de culture. Il s'applique aussi aux substances biologiques ou chimiques pour l'isolement et la purification de leurs composants. @fr
scope note: Used with bacteria, viruses, fungi, protozoa, and helminths for the obtaining of pure strains or for the demonstration of the presence of or identification of organisms by DNA analyses, immunologic, or other methods, including culture techniques. It is used also with biological substances and chemicals for the isolation and purification of the constituents.