therapy (Qualifier)
type: Qualifier
type: Concept
narrower: rehabilitation (Qualifier)
preferred label: thérapie (Qualificatif) @fr

rehabilitation (Qualifier)
type: Qualifier
type: Concept
created: 1973-12-27
established: 1967-01-01
modified: 2003-07-22
alternative label: REHABIL (Qualifier)
alternative label: RH (Qualifier)
broader: therapy (Qualifier)
in scheme: JVR
preferred label: rééducation et réadaptation (Qualificatif) @fr
scope note: Used with diseases and surgical procedures for restoration of function of the individual.
scope note: S'applique aux maladies et aux procédures chirurgicales pour la récupération d'une fonction chez un individu. @fr