radiation effects (Qualifier)
type: Qualifier
type: Concept
created: 1973-12-27
established: 1966-01-01
modified: 2003-07-22
alternative label: RE (Qualifier)
alternative label: RAD EFF (Qualifier)
in scheme: JVR
preferred label: effets des radiations (Qualificatif) @fr
scope note: Used for effects of ionizing and nonionizing radiation upon living organisms, organs and tissues, and their constituents, and upon physiologic processes. It includes the effect of irradiation on drugs and chemicals.
scope note: S'emploie pour les effets des radiations ionisantes ou non ionisantes sur les organismes vivants, les organes, les tissus et leurs constituants, ainsi que sur les processus physiologiques. Il inclut les effets de l'irradiation sur les médicaments et les substances chimiques. @fr
top concept of: JVR