drug therapy (Qualifier)
type: Qualifier
type: Concept
alternative label: DT (Qualifier)
alternative label: chimiothérapie (Qualificatif) @fr
alternative label: DRUG THER (Qualifier)
in scheme: JVR
preferred label: traitement médicamenteux (Qualificatif) @fr
scope note: Used with disease headings for the treatment of disease by the administration of drugs, chemicals, and antibiotics. For diet therapy and radiotherapy, use specific subheadings. Excludes immunotherapy for which "therapy" is used.
scope note: S'applique aux maladies pour leur traitement par l'administration de médicaments, de substances chimiques ou d'antibiotiques. Pour le régime alimentaire et la radiothérapie, les qualificatifs "diétothérapie" et "radiothérapie" sont respectivement utilisés. Il exclut l'immunothérapie, pour laquelle le qualificatif "thérapie" est employé. @fr
top concept of: JVR