biosynthesis (Qualifier)
type: Qualifier
type: Concept
created: 1973-12-27
established: 1966-01-01
modified: 2003-07-22
alternative label: BIOSYN (Qualifier)
alternative label: BI (Qualifier)
broader: metabolism (Qualifier)
in scheme: JVR
preferred label: biosynthèse (Qualificatif) @fr
scope note: S'emploie pour l'anabolisme des substances chimiques chez les organismes, dans les cellules vivantes ou les fractions subcellulaires. @fr
scope note: Used for the anabolic formation of chemical substances in organisms, in living cells, or by subcellular fractions.

metabolism (Qualifier)
type: Qualifier
type: Concept
narrower: biosynthesis (Qualifier)
preferred label: métabolisme (Qualificatif) @fr