therapeutic use (Qualifier)
type: Concept
type: Qualifier
created: 1973-12-27
established: 1966-01-01
modified: 2004-07-13
alternative label: TU (Qualifier)
alternative label: THER USE (Qualifier)
in scheme: JVR
narrower: JVR-NB0XHT3S-N
narrower: JVR-TJHVZCRZ-0
preferred label: usage thérapeutique (Qualificatif) @fr
scope note: S'applique aux médicaments, aux préparations biologiques et aux agents physiques pour leur utilisation dans la prévention et le traitement des maladies. Il inclut l’utilisation vétérinaire. @fr
scope note: Used with drugs, biological preparations, and physical agents for their use in the prophylaxis and treatment of disease. It includes veterinary use.
top concept of: JVR