pathology (Qualifier)
type: Qualifier
type: Concept
created: 1973-12-27
established: 1966-01-01
modified: 2016-06-15
alternative label: PA (Qualifier)
alternative label: PATHOL (Qualifier)
alternative label: anatomie pathologique (Qualificatif) @fr
broader: anatomy & histology (Qualifier)
in scheme: JVR
preferred label: anatomopathologie (Qualificatif) @fr
scope note: Used for organ, tissue, or cell structure in disease states.
scope note: S'emploie pour la structure des organes, des tissus ou des cellules dans les états pathologiques. @fr

anatomy & histology (Qualifier)
type: Qualifier
type: Concept
narrower: pathology (Qualifier)
preferred label: anatomie et histologie (Qualificatif) @fr