chemistry (Qualifier)
type: Concept
type: Qualifier
created: 1990-08-29
established: 1991-01-01
modified: 2003-07-24
alternative label: CHEM (Qualifier)
alternative label: CH (Qualifier)
in scheme: JVR
narrower: JVR-M63HSDM7-1
narrower: JVR-THHNVC7V-3
narrower: analogs & derivatives (Qualifier)
narrower: JVR-R0ZCQ8X6-J
preferred label: composition chimique (Qualificatif) @fr
scope note: Used with chemicals, biological, and non-biological substances for their composition, structure, characterization, and properties; also used for the chemical composition or content of organs, tissue, tumors, body fluids, organisms, and plants. Excludes chemical analysis and determination of substances for which "analysis" is used; excludes synthesis for which "chemical synthesis" is used; excludes isolation and purification of substances for which "isolation & purification" is used.
scope note: S'applique aux substances chimiques, biologiques ou non biologiques pour leur composition, leur structure, leur caractérisation et leurs propriétés. Il s'emploie aussi pour la composition chimique ou le contenu des organes, des tissus, des tumeurs, des liquides biologiques, des organismes et des végétaux. Il exclut l'analyse chimique et la détermination de substances, pour lesquelles le qualificatif "analyse" est utilisé. Il exclut la synthèse, pour laquelle le qualificatif "synthèse chimique" est employé. Il exclut l'isolement et la purification de substances, pour lesquels le qualificatif "isolement et purification" est utilisé. @fr
top concept of: JVR

analogs & derivatives (Qualifier)
type: Qualifier
type: Concept
broader: chemistry (Qualifier)
preferred label: analogues et dérivés (Qualificatif) @fr