economics (Qualifier)
type: Qualifier
type: Concept
created: 1977-05-16
established: 1978-01-01
modified: 2003-07-24
alternative label: ECON (Qualifier)
alternative label: EC (Qualifier)
broader: JVR-MPGVB7LK-P
in scheme: JVR
preferred label: économie (Qualificatif) @fr
scope note: S'emploie pour les aspects économiques et les aspects de gestion financière. Il inclut la collecte et la distribution de fonds. @fr
scope note: Used for the economic aspects of any subject, as well as for all aspects of financial management. It includes the raising or providing of funds.