chemically induced (Qualifier)
type: Qualifier
type: Concept
created: 1973-12-27
established: 1967-01-01
modified: 2003-07-22
alternative label: CI (Qualifier)
alternative label: CHEM IND (Qualifier)
broader: etiology (Qualifier)
in scheme: JVR
preferred label: induit chimiquement (Qualificatif) @fr
scope note: S'emploie pour les phénomènes biologiques, les maladies, les syndromes, les malformations congénitales et les symptômes provoqués par des substances endogènes ou exogènes. @fr
scope note: Used for biological phenomena, diseases, syndromes, congenital abnormalities, or symptoms caused by endogenous or exogenous substances.

etiology (Qualifier)
type: Qualifier
type: Concept
narrower: chemically induced (Qualifier)
preferred label: étiologie (Qualificatif) @fr