prevention & control (Qualifier)
type: Qualifier
type: Concept
created: 1973-12-27
established: 1996-01-01
modified: 2017-04-11
alternative label: PC (Qualifier)
alternative label: PREV (Qualifier)
broader: therapy (Qualifier)
in scheme: JVR
preferred label: prévention et contrôle (Qualificatif) @fr
scope note: Used with disease headings for increasing human or animal resistance against disease (e.g., immunization), for control of transmission agents, for prevention and control of environmental hazards, or for prevention and control of social factors leading to disease. It includes preventive measures in individual cases.
scope note: S'applique aux maladies pour l'augmentation de la résistance humaine ou animale à ces maladies (par exemple, par immunisation), pour le contrôle des agents de transmission, ainsi que pour la prévention et le contrôle des risques environnementaux et des facteurs sociaux pathogènes. Il comprend les mesures préventives prises dans les cas individuels. @fr

therapy (Qualifier)
type: Qualifier
type: Concept
narrower: prevention & control (Qualifier)
preferred label: thérapie (Qualificatif) @fr